   Compiling rust-xmpp v0.5.0 (/workspace/scratch/362577cdf2e0/rust-xmpp-next)
    Finished `test` profile [unoptimized + debuginfo] target(s) in 1.82s
     Running tests/admin_socket.rs (target/debug/deps/admin_socket-572bc055bcf12a3a)

running 1 test
test prosody_wire_commands_password_prompt_and_safe_errors ... FAILED

failures:

---- prosody_wire_commands_password_prompt_and_safe_errors stdout ----

thread 'prosody_wire_commands_password_prompt_and_safe_errors' (996) panicked at tests/admin_socket.rs:25:62:
called `Result::unwrap()` on an `Err` value: create admin Unix socket

Caused by:
    Operation not permitted (os error 1)
note: run with `RUST_BACKTRACE=1` environment variable to display a backtrace


failures:
    prosody_wire_commands_password_prompt_and_safe_errors

test result: FAILED. 0 passed; 1 failed; 0 ignored; 0 measured; 0 filtered out; finished in 0.00s

error: test failed, to rerun pass `--test admin_socket`
